{"text_format":"1","workbook":"xlsx","n_sheets":20,"sheets":["Instructions","Main","Bermuda","Bahia","Winter_Grazing","Summer_Annual","Hay","Feed","Vet","Auction","Lvstk_Facil","Equipment","Fixed_Cost","Fixed_Payment","J","K","L","M","N","O"],"not_rendered":{"charts":0,"images":1,"macros":1,"external_links":4,"defined_names":279,"comments":1,"pivot_tables":0},"unopened":[],"bounds":{"document_bytes":16777216,"sheet_cells":100000,"rows_first":2000,"rows_last":500,"rows_between":2000,"halvings":0,"cell_chars":16384,"cell_head_chars":4096},"cells_cut":0,"cells_raw":0,"read":"whole","date_system":"1900"}

{"sheet":"Instructions","index":0,"n_rows":20,"n_cols":8,"rows_kept":20,"cut":false,"hidden":false,"merged":[]}
[]
[]
[]
[null,"       WELCOME TO THE SOUTH GEORGIA",null,null,null,null,null,"REMEMBER"]
[null,null,"COW-CALF  BUDGET"]
[null,null,null,null,null,null,"  In order to Print a specific budget"]
[null,null,"Budget","Button",null,null,"  you must Calculate before you"]
[null,null," Type",null,null,null,"  Print that particular budget."]
[]
[null,null,"TOTAL","  "]
[null,null,"COST",null,null,null,null,"NOTE"]
[]
[null,null,"CASH ",null,null,null,"  All input in red and black is not to"]
[null,null,"FLOW",null,null,null,"  be tampered with! Only type into"]
[null,null,null,null,null,null,"  cells that contain green characters."]
[null,null," VARIABLE "]
[null,null,"COST"]
[]
[null,null,"Note: Be sure to enable all"]
[null,null,"macros on start-up."]
{"$rows_left_out":1}
{"sheet":"Main","index":1,"n_rows":278,"n_cols":52,"rows_kept":278,"cut":false,"hidden":false,"merged":[[126,1,126,2],[127,1,127,2],[128,1,128,2],[117,5,117,8],[118,5,118,8],[119,5,119,8],[125,1,125,2],[123,1,123,9],[77,3,77,4],[78,3,78,4],[91,1,91,2],[87,1,87,2],[85,1,85,2],[84,1,84,2],[86,1,86,2],[61,1,61,2],[62,1,62,2],[68,1,68,2],[63,1,63,2],[76,3,76,4],[66,1,66,2],[92,1,92,2],[88,1,88,2],[89,1,89,2],[90,1,90,2],[72,1,72,2],[73,1,73,2],[74,1,74,2],[75,1,75,2],[83,1,83,2],[77,1,77,2],[78,1,78,2],[79,1,79,2],[76,1,76,2],[47,1,47,2],[48,1,48,2],[49,1,49,2],[50,1,50,2],[57,1,57,2],[52,1,52,2],[56,1,56,2],[0,1,0,11],[1,1,1,11],[2,1,2,11],[3,1,3,11],[43,9,44,9],[43,8,44,8],[12,1,12,11],[14,1,14,9],[13,1,13,9],[17,1,17,2],[9,1,10,2],[30,1,30,2],[31,1,31,2],[35,1,35,2],[36,1,36,2],[37,1,37,2],[18,1,18,2],[19,1,19,2],[20,1,20,2],[21,1,21,2],[109,1,109,9],[107,1,107,9],[108,1,108,9],[106,1,106,9],[54,1,54,2],[22,1,22,2],[95,1,95,9],[46,1,46,2],[70,1,70,2],[64,1,64,2],[67,1,67,2],[65,1,65,2],[60,1,60,2],[51,1,51,2],[58,1,58,2],[23,1,23,2],[24,1,24,2],[25,1,25,2],[38,1,38,2],[39,1,39,2],[26,1,26,2],[27,1,27,2],[28,1,28,2],[29,1,29,2],[40,1,40,2],[59,1,59,2],[53,1,53,2],[55,1,55,2]]}
[null," COW-CALF BUDGET (SOUTH GEORGIA)",null,null,null,null,null,null,null,null,null,null,null,null,null,null,null,null,null,3,null,null,null,3,2,1]
[null,"Revised by R. Curt Lacy, 2010"]
[null,"Extension Agricultural Economics Department, University of Georgia",null,null,null,null,null,null,null,null,null,null,null,null,null,null,null,null,null,null,null,null,null,null,null,"(Total Cost Budget)"]
[null,"Based on Budgets Originally Developed by John C. McKissick",null,null,null,null,null,null,null,null,null,null,null,null,null,null,null,null,null,null,null,null,null,null,null,"(Cash Cost Budget)"]
[null,null,null,null,null,null,null,null,null,null,null,null,null,null,null,null,null,null,null,null,null,null,null,null,null,"(Variable Cost Budget)"]
[]
[]
[null,"INPUT DATA: Your values in the unprotected or highlighted cells",null,null,null,null,null,null,null,null,null,null,null,null,null,null,null,null,null,null,null,null,null,null,null,"DIRECT FIXED COST"]
[null,null,null,null,null,null,null,null,null,null,"",null,null,null,null,null,null,null,null,null,null,null,null,null,null,"ANNUAL FIXED PAYMENT"]
[null,"Select Budget Types",null,null,null,null,null,null,null,null,null,null,null,null,null,null,null,null,null,null,null,null,null,null,null,"DIRECT FIXED COST"]
[]
[null,null,null,null,null,null,null,null,null,null,null,null,null,null,null,null,null,null,null,null,null,null,null,null,null,"RETURNS OVER TOTAL COST ADJUSTED FOR RISK"]
[null,null,null,null,null,null,null,null,null,null,null,null,null,null,null,1,null,null,null,3,null,null,null,3,2,1]
[null," COW-CALF BUDGET (SOUTH GEORGIA-2013",null,null,null,null,null,null,null,null,null,null,null,null,null,3,null,null,null,3,null,null,null,3,2,1]
[null,{"$f":"+IF(bud_type=3,(Z3),IF(bud_type=2,(Z4),(Z5)))","v":"(Total Cost Budget)"},null,null,null,null,null,null,null,null,null,null,null,null,null,null,null,null,null,null,null,null,null,null,null,"RETURNS OVER CASH FLOW COST ADJUSTED FOR RISK"]
[null,null,null,null,null,null,null,null,null,null,null,null,null,null,null,null,null,null,null,null,null,null,null,null,null,"RETURNS OVER VARIABLE COST ADJUSTED FOR RISK"]
[]
[null,"NUMBER OF BROOD COWS",null,null,null,null,null,100,null,null,null,null,null,null,null,null,null,null," "]
[null,"PERCENT CALF CROP (DECIMAL)",null,null,null,null,null,{"$f":"85%","v":0.85},null,null,null,null,null,null,null,null,null,null," "]
[null,"COW CULLING PERCENTAGE (DECIMAL)",null,null,null,null,null,0.15,null,null,"",null,null,null,null,null,null,null," "]
{"$rows_left_out":259}
{"sheet":"Bermuda","index":2,"n_rows":16,"n_cols":9,"rows_kept":16,"cut":false,"hidden":false,"merged":[[13,0,13,3],[14,0,14,3],[10,0,10,3],[12,0,12,3],[11,0,11,3],[0,8,0,9],[2,0,2,7],[9,0,9,3],[5,0,5,3],[6,0,6,3],[7,0,7,3],[8,0,8,3],[4,0,4,3]]}
[null,null,null,null,null,null,null,null,"Return To Main"]
[]
["Hybrid Bermuda Pasture Per Acre Cost Detail "]
[]
["Item",null,null,null,"Unit","Quantity","Price","Total"]
["Prorated Establishment Cost",null,null,null,"YRS.",10,0,{"$f":"+G6/F6","v":0}]
["Fertilizer"]
[" Nitrogen",null,null,null,"LBS.",150,0.7,{"$f":"+G8*F8","v":105}]
[" Phosphorous (P2O5)",null,null,null,"LBS.",30,0.6,18]
[" Potash (K2O)",null,null,null,"LBS.",65,0.55000000000000004,35.75]
["Lime",null,null,null,"TONS",0.4,35,14]
["Machinery Repairs & Maintenance",null,null,null,"ACRE",1,1.74,1.74]
["Machinery Fuel",null,null,null,"Gallons",1.45,4,5.8]
["Labor",null,null,null,"Hours",0.33,9,2.97]
["Other",null,null,null,"Acre",0,2,0]
["TOTAL COST PER ACRE",null,null,null,null,null,null,{"$f":"+SUM(H6:H15)","v":183.26000000000002}]

{"sheet":"Bahia","index":3,"n_rows":16,"n_cols":9,"rows_kept":16,"cut":false,"hidden":false,"merged":[[13,0,13,3],[14,0,14,3],[4,0,4,3],[0,8,0,9],[9,0,9,3],[10,0,10,3],[12,0,12,3],[11,0,11,3],[5,0,5,3],[6,0,6,3],[7,0,7,3],[8,0,8,3],[2,0,2,7]]}
[null,null,null,null,null,null,null,null,"Return To Main"]
[]
["Bahia Pasture Per Acre Cost Detail"]
[]
["Item",null,null,null,"Unit","Quantity","Price","Total"]
["Prorated Establishment Cost",null,null,null,"YRS.",10,0,{"$f":"+G6/F6","v":0}]
["Fertilizer"]
[" Nitrogen",null,null,null,"LBS.",75,0.7,{"$f":"+G8*F8","v":52.5}]
[" Phosphorous (P2O5)",null,null,null,"LBS.",40,0.6,24]
[" Potash (K2O)",null,null,null,"LBS.",40,0.55000000000000004,22]
["Lime",null,null,null,"TONS",0.33,35,11.55]
["Machinery Repairs & Maintenance",null,null,null,"ACRE",1,1.73,1.73]
["Machinery Fuel",null,null,null,"Gallons",1.45,4,5.8]
["Labor",null,null,null,"Hours",0.33,9,2.97]
["Other",null,null,null,"Acre",0,2,0]
["TOTAL COST PER ACRE",null,null,null,null,null,null,{"$f":"+SUM(H6:H15)","v":120.55}]

{"sheet":"Winter_Grazing","index":4,"n_rows":19,"n_cols":9,"rows_kept":19,"cut":false,"hidden":false,"merged":[[17,0,17,3],[4,0,4,3],[0,8,0,9],[12,0,12,3],[13,0,13,3],[15,0,15,3],[14,0,14,3],[6,0,6,3],[9,0,9,3],[7,0,7,3],[10,0,10,3],[11,0,11,3],[2,0,2,7],[16,0,16,3],[8,0,8,3],[5,0,5,3]]}
[null,null,null,null,null,null,null,null,"Return To Main"]
[]
["Winter Grazing Per Acre Cost Detail"]
[]
["Item",null,null,null,"Unit","Quantity","Price","Total"]
["Wheat",null,null,null,"Bushel",1,10.5,{"$f":"+G6*F6","v":10.5}]
["Rye",null,null,null,"Bushel",1,13.5,{"$f":"+G7*F7","v":13.5}]
["Ryegrass",null,null,null,"Lbs.",15,0.35,{"$f":"+G8*F8","v":5.25}]
["Clover",null,null,null,"Lbs.",0,1.35,{"$f":"+G9*F9","v":0}]
["Fertilizer"]
[" Nitrogen",null,null,null,"LBS.",150,0.7,105]
[" Phosphorous (P2O5)",null,null,null,"LBS.",50,0.6,30]
[" Potash (K2O)",null,null,null,"LBS.",50,0.55000000000000004,27.500000000000004]
["Lime",null,null,null,"TONS",0,35,0]
["Machinery Repairs & Maintenance",null,null,null,"ACRE",1,2.68,2.68]
["Machinery Fuel",null,null,null,"Gallons",1.45,4,5.8]
["Labor",null,null,null,"Hours",0.6,9,5.3999999999999995]
["Other",null,null,null,"Acre",0,2,0]
["TOTAL COST PER ACRE",null,null,null,null,null,null,{"$f":"+SUM(H6:H18)","v":205.63000000000002}]

{"sheet":"Summer_Annual","index":5,"n_rows":16,"n_cols":9,"rows_kept":16,"cut":false,"hidden":false,"merged":[[13,0,13,3],[5,0,5,3],[14,0,14,3],[4,0,4,3],[0,8,0,9],[9,0,9,3],[10,0,10,3],[12,0,12,3],[11,0,11,3],[6,0,6,3],[7,0,7,3],[8,0,8,3],[2,0,2,7]]}
[null,null,null,null,null,null,null,null,"Return To Main"]
[]
["Summer Annual Per Acre Cost Detail"]
[]
["Item",null,null,null,"Unit","Quantity","Price","Total"]
["Millet/Forage Sorghum",null,null,null,"Lbs.",20,0.8,{"$f":"+G6*F6","v":16}]
["Fertilizer"]
[" Nitrogen",null,null,null,"LBS.",180,0.7,{"$f":"+G8*F8","v":125.99999999999999}]
[" Phosphorous (P2O5)",null,null,null,"LBS.",40,0.6,24]
[" Potash (K2O)",null,null,null,"LBS.",80,0.5,40]
["Lime",null,null,null,"TONS",0,35,0]
["Machinery Repairs & Maintenance",null,null,null,"ACRE",2,3.5,7]
["Machinery Fuel",null,null,null,"Gallons",3,3,9]
["Other",null,null,null,"Acre",0,2,0]
["Other",null,null,null,"Acre",0,2,0]
["TOTAL COST PER ACRE",null,null,null,null,null,null,{"$f":"+SUM(H6:H15)","v":222}]

{"sheet":"Hay","index":6,"n_rows":23,"n_cols":9,"rows_kept":23,"cut":false,"hidden":false,"merged":[[0,8,0,9],[2,0,2,7],[9,0,9,3],[10,0,10,3],[1,0,1,1],[4,0,4,3],[5,0,5,3],[6,0,6,3],[7,0,7,3],[8,0,8,3],[19,0,19,6],[20,0,20,6],[22,0,22,6],[17,0,17,3],[13,0,13,3],[12,0,12,3],[16,0,16,3],[14,0,14,3],[15,0,15,3],[11,0,11,3]]}
[null,null,null,null,null,null,null,null,"Return To Main"]
["Tons per Acre",null,5]
["Hybrid Bermuda Hay Per Acre Cost Detail "]
[]
["Item",null,null,null,"Unit","Quantity","Price","Total"]
["Prorated Establishment Cost",null,null,null,"YRS.",10,0,{"$f":"+G6/F6","v":0}]
["Fertilizer"]
[" Nitrogen",null,null,null,"LBS.",250,0.7,{"$f":"+G8*F8","v":175}]
[" Phosphorous (P2O5)",null,null,null,"LBS.",60,0.6,36]
[" Potash (K2O)",null,null,null,"LBS.",200,0.55000000000000004,110.00000000000001]
["Lime",null,null,null,"TONS",0.5,35,17.5]
["Herbicide",null,null,null,"Acre",1,4.5,{"$f":"+G12*F12","v":4.5}]
["Machinery Repairs & Maintenance",null,null,null,"ACRE",1,18.5,18.5]
["Machinery Fuel",null,null,null,"Gallons",12.5,4,50]
["Labor",null,null,null,"Hours",2.67,9,24.03]
["Other",null,null,null,"Acre",0,2,0]
["TOTAL COST PER ACRE",null,null,null,null,null,null,{"$f":"+SUM(H6:H16)","v":435.53}]
["TOTAL VARIABLE COST PER TON",null,null,null,null,null,null,{"$f":"+hay/hay_tons","v":87.105999999999995}]
[]
["TOTAL FIXED COSTS",null,null,null,null,null,null,{"$f":"+equip_fc","v":6874.2063999999991}]
{"$rows_left_out":4}
{"sheet":"Feed","index":7,"n_rows":48,"n_cols":8,"rows_kept":48,"cut":false,"hidden":false,"merged":[[38,0,38,6],[0,7,0,8],[1,0,1,6],[14,0,14,6],[26,0,26,6]]}
[null,null,null,null,null,null,null,"Return To Main"]
["Supplemental Feed for Cows"]
["Ingredient","Unit","Days fed","Pounds Fed per Day","Total Tons Fed","$/unit","Cost/Cow"]
["WCS","Tons",100,6,{"$f":"+D4*C4/2000","v":0.3},300,{"$f":"+F4*E4","v":90}]
[null,"Tons",0,22,{"$f":"+D5*C5/2000","v":0},90,{"$f":"+F5*E5","v":0}]
[null,"Tons",null,0,0,0,0]
[null,"Tons",null,0,0,0,0]
[null,"Tons",null,0,0,0,0]
[null,"Tons",null,0,0,0,0]
[null,"Tons",null,0,0,0,0]
["Total Feed for Cows",null,null,null,{"$f":"SUM(E4:E10)","v":0.3},{"$f":"+IF(cowfeed_lbs>0,cowfeed_cost/cowfeed_lbs,0)","v":300},{"$f":"SUM(G4:G10)","v":90}]
[]
[]
[]
["Supplemental Feed for Replacement Heifers"]
["Ingredient","Unit","Days fed","Pounds Fed per Day","Total Tons Fed","$/unit","Cost/Cow"]
["WCS","Tons",0,6,{"$f":"+D17*C17/2000","v":0},300,{"$f":"+(E17*F17)","v":0}]
[null,"Tons",0,22,{"$f":"+D18*C18/2000","v":0},90,{"$f":"+(E18*F18)","v":0}]
[null,"Tons",null,0,0,0,0]
[null,"Tons",null,0,0,0,0]
{"$rows_left_out":29}
{"sheet":"Vet","index":8,"n_rows":40,"n_cols":8,"rows_kept":40,"cut":false,"hidden":false,"merged":[[32,0,32,6],[1,7,1,10],[2,0,2,6],[12,0,12,6],[13,0,13,6],[23,0,23,6]]}
[]
[null,null,null,null,null,null,null,"Return to Main Page"]
["Veterinary Expenses for Cow Herd"]
["Item",null,"Item","Unit","Number Applications","$/Applic.","Total Cost/Cow"]
["IBR,BVD,5-way Lepto, Vibrio",2,{"$f":"+IF(B5=1,#REF!,IF(B5=2,#REF!,IF(B5=3,#REF!,IF(B5=4,#REF!,IF(B5=5,#REF!)))))","v":{"$error":"#REF!"}},"Cow",1,4,{"$f":"+F5*E5","v":4}]
["Deworm",1,{"$f":"+IF(B6=1,#REF!,IF(B6=2,#REF!,IF(B6=3,#REF!,IF(B6=4,#REF!,IF(B6=5,#REF!)))))","v":{"$error":"#REF!"}},"Cow",1,3,3]
["Delice",3,{"$f":"+IF(B7=1,#REF!,IF(B7=2,#REF!,IF(B7=3,#REF!,IF(B7=4,#REF!,IF(B7=5,#REF!)))))","v":{"$error":"#REF!"}},"Cow",2,2,4]
["Fly Tags",4,{"$f":"+IF(B8=1,#REF!,IF(B8=2,#REF!,IF(B8=3,#REF!,IF(B8=4,#REF!,IF(B8=5,#REF!)))))","v":{"$error":"#REF!"}},"Cow",2,0.5,1]
["Preg Check",5,{"$f":"+IF(B9=1,#REF!,IF(B9=2,#REF!,IF(B9=3,#REF!,IF(B9=4,#REF!,IF(B9=5,#REF!)))))","v":{"$error":"#REF!"}},"Cow",1,2,2]
["Other",5,{"$f":"+IF(B10=1,#REF!,IF(B10=2,#REF!,IF(B10=3,#REF!,IF(B10=4,#REF!,IF(B10=5,#REF!)))))","v":{"$error":"#REF!"}},"Cow",1,0,0]
["Total Vet Expenses for Cows",null,null,null,null,null,{"$f":"+SUM(G5:G9)","v":14}]
[]
[]
["Veterinary Expenses for Replacement Heifers"]
["Item",null,"Item","Unit","Number Applications","$/Applic.","Total Cost/Cow"]
["5-way Lepto",2,{"$f":"+IF(B16=1,#REF!,IF(B16=2,#REF!,IF(B16=3,#REF!,IF(B16=4,#REF!,IF(B16=5,#REF!)))))","v":{"$error":"#REF!"}},"Heifer",2,2,{"$f":"+F16*E16","v":4}]
["Synchronization",1,{"$f":"+IF(B17=1,#REF!,IF(B17=2,#REF!,IF(B17=3,#REF!,IF(B17=4,#REF!,IF(B17=5,#REF!)))))","v":{"$error":"#REF!"}},"Heifer",0,8,{"$f":"+F17*E17","v":0}]
[null,3,{"$f":"+IF(B18=1,#REF!,IF(B18=2,#REF!,IF(B18=3,#REF!,IF(B18=4,#REF!,IF(B18=5,#REF!)))))","v":{"$error":"#REF!"}},"Heifer",0,1,{"$f":"+F18*E18","v":0}]
[null,4,{"$f":"+IF(B19=1,#REF!,IF(B19=2,#REF!,IF(B19=3,#REF!,IF(B19=4,#REF!,IF(B19=5,#REF!)))))","v":{"$error":"#REF!"}},"Heifer",1,4,{"$f":"+F19*E19","v":4}]
[null,5,{"$f":"+IF(B20=1,#REF!,IF(B20=2,#REF!,IF(B20=3,#REF!,IF(B20=4,#REF!,IF(B20=5,#REF!)))))","v":{"$error":"#REF!"}},"Heifer",null,null,{"$f":"+F20*E20","v":0}]
{"$rows_left_out":21}
{"sheet":"Auction","index":9,"n_rows":12,"n_cols":8,"rows_kept":12,"cut":false,"hidden":false,"merged":[[11,0,11,2],[5,0,5,2],[2,0,2,6],[2,7,2,9],[6,0,6,2],[9,0,9,2],[10,0,10,2],[7,0,7,2],[8,0,8,2]]}
[]
[]
["Auction & Hauling Cost Detail",null,null,null,null,null,null,"Return to Main Budget"]
[]
["     ITEM",null,null,"UNIT","QUANTITY","PRICE","AMOUNT"]
["Commission",null,null,"%",{"$f":"+Main!C103*Main!G103","v":784.96328625000035},0.03,{"$f":"+F6*E6","v":23.548898587500009}]
["Yardage",null,null,"Day",1,1,{"$f":"+F7*E7","v":1}]
["Hauling",null,null,"MILES",100,2.5,{"$f":"+(E8*F8)/24","v":10.416666666666666}]
["Checkoff",null,null,"Head",1,1,{"$f":"+F9*E9","v":1}]
["Other",null,null,"Head",1,1,{"$f":"+F10*E10","v":1}]
[]
["Total Auction & Hauling Cost",null,null,null,null,null,{"$f":"+SUM(G6:G10)","v":36.965565254166677}]

{"sheet":"Lvstk_Facil","index":10,"n_rows":47,"n_cols":14,"rows_kept":47,"cut":false,"hidden":false,"merged":[[12,1,12,2],[10,1,10,2],[7,1,7,2],[8,1,8,2],[9,1,9,2],[7,7,7,8],[4,1,4,2],[2,1,2,13],[5,1,5,2],[6,1,6,2],[24,1,24,2],[44,1,44,3],[32,1,32,3],[37,1,37,3],[33,1,33,3],[31,1,31,8],[27,1,27,3],[46,1,46,3],[35,1,35,3],[34,1,34,3],[38,1,38,3],[39,1,39,3],[42,1,42,3],[43,1,43,3]]}
[]
[]
[null,"INVESTMENT, ANNUAL FIXED COSTS, AND ANNUAL PAYMENTS"]
[null,null,null,null,null,null,null,null,null,""]
[null,"Return to Main Budget"]
[null,"Item",null,"Number","$/Unit","Total Cost","Salvage Value","Years of Useful Life","Annual Depreciation","Percent Financed","Amount Financed","Interest Rate","Years Financed","Annual Payment"]
[null,"LIVESTOCK"]
[null,"Raised Females",null,70,700,{"$f":"D8*E8","v":49000},{"$f":"+((cow_wt*cow_price)*(100%-cow_death))*D8","v":49048.999999999993},"No dep. on raised animals",null,0,{"$f":"+J8*F8","v":0},0.08,7,{"$f":"-PMT(L8,M8,K8)","v":0}]
[null,"Purchased Females",null,0,750,{"$f":"D9*E9","v":0},{"$f":"+((cow_wt*cow_price)*(100%-cow_death))*D9","v":0},{"$f":"1/cow_cull","v":6.666666666666667},{"$f":"+(F9-G9)/H9","v":0},0.5,{"$f":"+J9*F9","v":0},0.08,5,{"$f":"-PMT(L9,M9,K9)","v":0}]
[null,"Bulls",null,3,2500,{"$f":"D10*E10","v":7500},{"$f":"+(bull_wt*bull_price)*bulls","v":3240},{"$f":"1/bull_cull","v":4},{"$f":"+(F10-G10)/H10","v":1065},0.25,{"$f":"+J10*F10","v":1875},0.08,5,{"$f":"-PMT(L10,M10,K10)","v":469.60585231281863}]
[null,"TOTAL LIVESTOCK",null,null,null,{"$f":"+SUM(F8:F10)","v":56500},{"$f":"+SUM(G8:G10)","v":52288.999999999993},null,{"$f":"+SUM(I8:I10)","v":1065},null,{"$f":"+SUM(K8:K10)","v":1875},null,null,{"$f":"SUM(N8:N10)","v":469.60585231281863}]
[]
[null,"BUILDINGS & FACILITIES"]
[null,"Fences (Miles)",null,{"$f":"+(7379+9261+4174+2952+3704)/5280","v":5.2026515151515156},1925,{"$f":"+IF(D14<>0,(D14*E14),0)","v":10015.104166666668},0,30,{"$f":"+(F14-G14)/H14","v":333.8368055555556},0,{"$f":"+J14*F14","v":0},0.08,20,{"$f":"-PMT(L14,M14,K14)","v":0}]
[null,"Head Gate",null,1,400,{"$f":"+IF(D15<>0,(D15*E15),0)","v":400},0,10,{"$f":"F15/H15","v":40},0,0,0.08,20,0]
[null,"Chutes & Pens",null,1,8500,8500,{"$f":"+F16*0.2","v":1700},20,425,0,0,0.08,10,0]
[null,"Barn",null,1,15000,15000,3000,30,500,0,0,0.08,20,0]
[null,"Hay Racks",null,3,250,750,0,7,107.14285714285714,0,0,0.08,10,0]
[null,"Feed Troughs",null,6,150,900,180,15,60,0,0,0.08,10,0]
[null,"Miscellanous Equipment",null,1,1000,1000,200,20,50,0,0,0.08,15,0]
{"$rows_left_out":28}
{"sheet":"Equipment","index":11,"n_rows":32,"n_cols":16,"rows_kept":32,"cut":false,"hidden":false,"merged":[[29,0,29,2],[30,0,30,2],[1,0,1,15],[0,0,0,1],[23,0,23,2],[24,0,24,2],[25,0,25,2],[28,0,28,2]]}
["Return to Main"]
["DETAIL FOR EQUIPMENT USED IN COW-CALF AND HAY OPERATIONS"]
["Item","Cost","Salvage Value","Useful Life","Depreciation","% Used in Cow-Calf","%Used in Hay","Cow-Calf Avg Investment","Hay Investment","Cow-Calf Depreciation","Hay Depreciation","%Financed","Interest Rate","Years","Total Payment","% Cattle or Hay Payment"]
["75 hp Tractor-2wd",{"$f":"37000*0.5","v":18500},{"$f":"+B4*0.2","v":3700},8,{"$f":"+(B4-C4)/D4","v":1850},0.25,0.25,{"$f":"+((B4+C4)/2)*F4","v":2775},{"$f":"+((B4+C4)/2)*G4","v":2775},{"$f":"+F4*E4","v":462.5},{"$f":"+G4*E4","v":462.5},0,0.08,5,{"$f":"IF(L4>0,-PMT(M4,N4,(B4*L4)),0)","v":0},{"$f":"+O4*(F4+G4)","v":0}]
["130 hp Tractor-MFWD",79000,{"$f":"+B5*0.2","v":15800},8,{"$f":"+(B5-C5)/D5","v":7900},0.1,0.1,{"$f":"+((B5+C5)/2)*F5","v":4740},{"$f":"+((B5+C5)/2)*G5","v":4740},{"$f":"+F5*E5","v":790},{"$f":"+G5*E5","v":790},0.5,0.08,5,{"$f":"IF(L5>0,-PMT(M5,N5,(B5*L5)),0)","v":9893.0299553900459},{"$f":"+O5*(F5+G5)","v":1978.6059910780093}]
["Front-end loader w/spear",5500,1100,8,550,0.25,0.25,825,825,137.5,137.5,0,0.08,5,0,0]
["7' Rotary Mower",3500,700,8,{"$f":"+(B7-C7)/D7","v":350},0.25,0.25,525,525,{"$f":"+F7*E7","v":87.5},{"$f":"+G7*E7","v":87.5},0,0.08,5,0,{"$f":"+O7*(F7+G7)","v":0}]
["14' Disk Harrow",9250,1850,10,740,0.1,0,555,0,74,0,0,0.08,5,0,0]
["12' Grain Drill",{"$f":"11500*0.33","v":3795},759,8,379.5,0.1,0,227.70000000000002,0,37.950000000000003,0,0,0.08,5,0,0]
["8' Disc Mower",6500,1300,5,1040,0.2,0.8,780,3120,208,832,0,0.08,5,0,0]
["17' Double Hay Rake",2500,500,8,250,0,1,0,1500,0,250,0,0.08,5,0,0]
["17' Hay Tedder",4500,900,8,450,0,1,0,2700,0,450,0,0.08,5,0,0]
["20' Hay Trailer -2",2750,550,8,275,0.5,0.5,825,825,137.5,137.5,0,0.08,5,0,0]
["Large Round Baler",{"$f":"23000*0.667","v":15341},3068.2000000000003,5,{"$f":"+(B14-C14)/D14","v":2454.56},0,1,0,9204.6,{"$f":"+F14*E14","v":0},{"$f":"+G14*E14","v":2454.56},0.5,0.08,5,1921.12623475492,{"$f":"+O14*(F14+G14)","v":1921.12623475492}]
["Other 1",0,0,5,0,0,1,0,0,0,{"$f":"+G15*E15","v":0},0,0.08,5,0,{"$f":"+O15*(F15+G15)","v":0}]
["Other 2",0,0,5,0,0,1,0,0,0,0,0,0.08,5,0,0]
["Other 3",0,0,5,0,0,1,0,0,0,0,0,0.08,5,0,0]
["Other 4",0,0,5,0,0,1,0,0,0,0,0,0.08,5,0,0]
["Other 5",0,0,5,0,0,1,0,0,0,0,0,0.08,5,0,0]
["Other 6",0,0,5,0,0,1,0,0,0,0,0,0.08,5,0,0]
{"$rows_left_out":13}
{"sheet":"Fixed_Cost","index":12,"n_rows":30,"n_cols":9,"rows_kept":30,"cut":false,"hidden":true,"merged":[[8,1,8,2]]}
[]
[]
[null,"INVESTMENT AND ANNUAL FIXED COST"]
[null,"(Check All Entries This Page)"]
[]
[null,"                                        NO. OF C0WS:",null,null,null,null,null,{"$f":"+Main!H18","v":100}]
[null,"                                        INTEREST RATE:",null,null,null,null,null,0.09]
[]
[null,"     ITEM",null,"NUMBER","COST/HEAD","NEW COST","SALVAGE","YEARS","DEPR."]
[null,"COWS",null,60,700,{"$f":"D10*E10","v":42000},{"$f":"Main!H27*Main!H28*D10","v":42900},{"$f":"1/Main!H20","v":6.666666666666667},{"$f":"+(F10-G10)/H10","v":-135}]
[null,"Purchased HEIFERS",null,0,850,{"$f":"D11*E11","v":0},0,6,{"$f":"+(F11-G11)/H11","v":0}]
[null,"BULLS",null,{"$f":"+Main!H29","v":3},1500,{"$f":"D12*E12","v":4500},{"$f":"+(Main!H31*Main!H32)*Main!H29","v":3240},4,315]
[]
[]
[]
[]
[null,"CORRAL & LOADING CHUTE",null,null,null,1200,0,10,120]
[null,"FENCE (MI.)",null,2.5,1800,{"$f":"D18*E18","v":4500},0,15,300]
[null,"FEED RACKS",null,null,null,800,0,10,80]
[null,"MISC. EQUIPMENT",null,null,null,500,0,5,100]
{"$rows_left_out":11}
{"sheet":"Fixed_Payment","index":13,"n_rows":42,"n_cols":10,"rows_kept":42,"cut":false,"hidden":true,"merged":[]}
[]
[]
[null,"ANNUAL ENTERPRISE FIXED PAYMENTS"]
[null," (Check All Entries This Page)"]
[]
[null,null,null,null,"NO. OF ACRES:",null,{"$f":"+Main!F47+Main!F48+Main!F50","v":125}]
[null,null,null,null,"NO. OF COWS:",null,{"$f":"+Main!H18","v":100}]
[]
[null,"DEBT PAYMENT CALCULATION ON NEW INVESTMENT:"]
[null,"(For Use In Calculating Fixed Cash Outlays on New Investment)"]
[]
[null,null,null,"","UNIT","TOTAL","    ----FINANCING----"]
[null,"ITEM",null,"NUMBER","COST","COST","AMOUNT","YEARS","INT.RATE","PAYMENT"]
[null,"COWS",null,100,500,{"$f":"D14*E14","v":50000},0.5,7,0.11,{"$f":"PMT(I14,H14,-F14*G14)","v":5305.3817362524424}]
[null,"HEIFERS",null,20,400,{"$f":"D15*E15","v":8000},0.5,7,0.11,{"$f":"PMT(I15,H15,-F15*G15)","v":848.86107780039072}]
[null,"BULLS",null,3,1500,{"$f":"D16*E16","v":4500},0.5,7,0.11,477.48435626271976]
[null,"FENCE (MI.)",null,2.5,1800,{"$f":"D17*E17","v":4500},0.5,7,0.11,477.48435626271976]
[null,"CORRAL & LOADING CHUTE",null,null,null,1200,0.5,7,0.11,127.32916167005862]
[null,"FEED RACKS",null,null,null,800,0.5,7,0.11,84.886107780039069]
[null,"MISC. EQUIP.",null,null,"",500,0.5,7,0.11,53.05381736252442]
{"$rows_left_out":23}
{"sheet":"J","index":14,"n_rows":14,"n_cols":15,"rows_kept":14,"cut":false,"hidden":true,"merged":[]}
[null,null,null,null,null,null,null,null,null,null,null,null,null,-8941.9831759052358,2.2750092654188533E-2]
[null,null,null,null,null,null,null,null,null,null,null,null,null,-6741.1663194289249,6.6807279375848599E-2]
[1,null,null,null,null,null,null,null,null,null,null,null,null,-4540.349462952614,0.15865531316113057]
[null,null,null,null,null,null,null,null,null,null,null,null,null,-3439.9410347144585,0.22662732264844102]
[null,null,null,null,null,null,null,null,null,null,null,null,null,-2339.5326064763035,0.3085375586179277]
[null,null,null,null,null,null,null,null,null,null,null,null,null,-1239.1241782381483,0.40129373468325191]
[null,null,null,null,null,null,null,null,null,null,null,null,null,-138.71574999999302,0.49999999977461573]
[null,null,null,null,null,null,null,null,null,null,null,null,null,-138.71574999999302,0.49999999977461573]
[null,null,null,null,null,null,null,null,null,null,null,null,null,961.69267823816199,0.59870626531674809]
[null,null,null,null,null,null,null,null,null,null,null,null,null,2062.101106476317,0.69146244138207225]
[null,null,null,null,null,null,null,null,null,null,null,null,null,3162.509534714472,0.77337267735155901]
[null,null,null,null,null,null,null,null,null,null,null,null,null,4262.917962952627,0.84134468683886943]
[null,null,null,null,null,null,null,null,null,null,null,null,null,6463.734819428937,0.93319272062415137]
[null,null,null,null,null,null,null,null,null,null,null,null,null,8664.551675905248,0.97724990734581152]

{"sheet":"K","index":15,"n_rows":0,"n_cols":0,"rows_kept":0,"cut":false,"hidden":true,"merged":[]}

{"sheet":"L","index":16,"n_rows":0,"n_cols":0,"rows_kept":0,"cut":false,"hidden":true,"merged":[]}

{"sheet":"M","index":17,"n_rows":0,"n_cols":0,"rows_kept":0,"cut":false,"hidden":true,"merged":[]}

{"sheet":"N","index":18,"n_rows":0,"n_cols":0,"rows_kept":0,"cut":false,"hidden":true,"merged":[]}

{"sheet":"O","index":19,"n_rows":2,"n_cols":2,"rows_kept":2,"cut":false,"hidden":true,"merged":[]}
[1,1]
[0]