{"text_format":"1","workbook":"xlsx","n_sheets":11,"sheets":["Instructions","Main","Winter Grazing","Rations","Ration Components","Procurement","Fixed_Cost","Fixed_Payment","J","K","L"],"not_rendered":{"charts":0,"images":0,"macros":1,"external_links":2,"defined_names":126,"comments":1,"pivot_tables":0},"unopened":[],"bounds":{"document_bytes":16777216,"sheet_cells":100000,"rows_first":2000,"rows_last":500,"rows_between":2000,"halvings":0,"cell_chars":16384,"cell_head_chars":4096},"cells_cut":0,"cells_raw":0,"read":"whole","date_system":"1900"}

{"sheet":"Instructions","index":0,"n_rows":20,"n_cols":8,"rows_kept":20,"cut":false,"hidden":false,"merged":[]}
[]
[]
[]
[null,null,null,null,null,null,null,"REMEMBER"]
[]
[null,null,null,null,null,null,"  In order to Print a specific budget"]
[null,null,"Budget","Button",null,null,"  you must Calculate before you"]
[null,null," Type",null,null,null,"  Print that particular budget."]
[]
[null,null,"TOTAL","  "]
[null,null,"COST"]
[]
[null,null,"CASH "]
[null,null,"FLOW"]
[]
[null,null," VARIABLE "]
[null,null,"COST"]
[]
[null,null,"Note: Be sure to enable all"]
[null,null,"macros on start-up."]

{"sheet":"Main","index":1,"n_rows":255,"n_cols":48,"rows_kept":255,"cut":false,"hidden":false,"merged":[[26,9,27,9],[18,7,18,8],[19,7,19,8],[20,7,20,8],[38,1,38,3],[40,1,40,3],[31,8,33,8],[31,6,33,6],[31,7,33,7],[31,1,33,3],[31,4,33,4],[31,5,33,5],[34,1,34,3],[26,5,27,5],[26,6,27,6],[26,7,27,7],[26,8,27,8],[39,1,39,3],[35,1,35,3],[36,1,36,3],[37,1,37,3],[47,1,47,3],[45,1,45,3],[46,1,46,3],[44,1,44,3],[41,1,41,3],[42,1,42,3],[43,1,43,3],[48,1,48,3],[49,1,49,3],[61,1,61,3],[77,1,77,4],[60,1,60,3],[76,1,76,4],[55,1,55,8],[51,1,51,3],[50,1,50,3],[72,1,72,8],[56,1,56,3],[104,5,104,7],[78,1,78,4],[79,1,79,4],[80,1,80,4],[103,5,103,8],[95,1,95,9],[96,1,96,9],[94,1,94,9],[92,1,92,9],[84,1,84,9],[16,1,16,9],[15,1,15,9],[0,1,0,9],[1,1,1,9],[5,1,5,9],[6,1,6,9],[7,1,7,9],[4,1,4,9],[2,1,3,9]]}
[null,"Stockering Steers",null,null,null,null,null,null,null,null,null,null,null,null,null,null,null,null,null,null,3]
[null,"Levi Russell, Lawton Stewart, and Dennis Hancock"]
[null,"Agricultural & Applied Economics, Animal & Dairy Sciences, and Crop and Soil Sciences Departments"]
[]
[null,null,null,null,null,null,null,null,null,null,null,null,null,null,null,null,null,null,null,null,null,null,null,1,2,3]
[null,"University of Georgia Cooperative Extension Service",null,null,null,null,null,null,null,null,null,null,null,null,null,null,null,null,"           "," "," "]
[null,null,null,null,null,null,null,null,null,null,null,null,null,null,null,null,null,null," ",null,null,null,null,null,null,"(Total Cost Budget)"]
[null,"February 2018",null,null,null,null,null,null,null,null,null,null,null,null,null,null,null,null," ",null,null,null,null,null,null,"(Cash Flow Budget)"]
[null,null,null,null,null,null,null,null,null,null,"",null,null,null,null,null,null,null," ",null,null,null,null,null,null,"(Variable Cost Budget)"]
[null,null,null,null,null,null,null,null,null,null,null,null,null,null,null,null,null,null," "]
[null,"INPUT DATA: Your values in the unprotected or highlighted cells",null,null,null,null,null,null,null,null,null,null,null,null,null,null,null,null," ",null,null,null,null,null,null,"RISK RATED RETURNS OVER TOTAL COST"]
[null,null,null,null,null,null,null,null,null,null,null,null,null,null,null,null,null,null," ",null,null,null,null,null,null,"RISK RATED RETURNS OVER CASH FLOW COST"]
[null,null,null,null,null,null,null,null,null,null,null,null,null,null,null,null,null,null," ",null,null,null,null,null,null,"RISK RATED RETURNS OVER VARIABLE COST"]
[null,null,null,null,null,null,null,null,null,null,"",null,null,null,null,null,null,null," "]
[null,null,null,null,null,null,null,null,null,null,null,null,null,null,null,null,null,null," "]
[null,"Stockering 500 pound Steers",null,null,null,null,null,null,null,null,null,null,null,null,null,null,null,null," "]
[null,"(Variable Cost Budget)",null,null,null,null,null,null,null,null,null,null,null,null,null,null,null,null," "]
[null,null,null,null,null,null,null,null,null,null,"",null,null,null,null,null,null,null," "]
[null,"NUMBER OF ACRES",null,null,null,50,null,"In Date",null,"2018-10-15",null,null,null,null,null,null,null,null," "]
[null,"STOCKING RATE (HEAD/ACRE)",null,null,null,2,null,"Out Date",null,{"$f":"+J19+F24","v":"2019-03-14"},"",null,null,null,null,null,null,null," "]
[null,"NUMBER OF CALVES PLACED",null,null,null,{"$f":"F19*F20","v":100},null,null,null,null,null,null,null,null,null,null,null,null," "]
[null,"DEATH LOSS (%)",null,null,null,1,null,null,null,null,"",null,null,null,null,null,null,null," "]
[null,"NUMBER OF CALVES SOLD",null,null,null,{"$f":"+F21*((100-F22)/100)","v":99},null,null,null,null,"",null,null,null,null,null,null,null,"          "]
[null,"FEEDING PERIOD (DAYS)",null,null,null,150]
[]
[null,null,null,null,null,"BEST","OPT.","MEDIAN","PESS.","WORST",""]
[null,"PAYWEIGHT TO PAYWEIGHT",null,null,null,3,{"$f":"+H27+0.25","v":2.25},2,{"$f":"+H27-0.25","v":1.75},1.5]
[null,"DAILY GAIN (LBS./DAY)"]
[null,"NET SELLING WEIGHT (CWT.)",null,null,null,{"$f":"((F27*F24)/100+F36)","v":9.5},{"$f":"(G27*F24/100+F36)","v":8.375},{"$f":"(H27*F24/100+F36)","v":8},{"$f":"(I27*F24/100+F36)","v":7.625},{"$f":"(J27*F24/100+F36)","v":7.25}]
[null,"SELLING PRICE ($/CWT.)",null,null,null,126,{"$f":"+(F30+H30)/2","v":130},134,{"$f":"+(H30+J30)/2","v":136},138]
{"$rows_left_out":226}
{"sheet":"Winter Grazing","index":2,"n_rows":267,"n_cols":48,"rows_kept":267,"cut":false,"hidden":false,"merged":[[43,1,43,6],[28,1,28,3],[3,3,3,6],[11,1,11,10],[71,2,71,7],[60,2,60,7],[17,1,17,4],[25,1,25,3],[26,1,26,3],[27,1,27,3],[49,1,49,4]]}
[null,"Winter Annual Grazing Budget",null,null,null,null,null,null,null,null,null,null,null,null,null,null,null,3,null,null,null,null,null,3,2,1]
[]
[null,"Ext. Ag. Econ. Dept., Univ. of Ga.",null,null,null,null,null,null,null,null,null,null,null,null,null,null,null,null,null,null,null,null,null,null,null,"(Total Cost Budget)"]
[null,null,null,null,null,null,null,null,null,null,null,null,null,null,null,null,null,null,null,null,null,null,null,null,null,"(Cash Flow Budget)"]
[null,null,null,null,null,null,null,null,null,null,"",null,null,null,null,null,null,null,null,null,null,null,null,null,null,"(Variable Cost Budget)"]
[]
[null,"INPUT DATA: Your values in the unprotected or highlighted cells",null,null,null,null,null,null,null,null,null,null,null,null,null,null,null,null,null,null,null,null,null,null,null,"DIRECT FIXED COST"]
[null,null,null,null,null,null,null,null,null,null,null,null,null,null,null,null,null,null,null,null,null,null,null,null,null,"ANNUAL FIXED PAYMENT"]
[null,null,null,null,null,null,null,null,null,null,null,null,null,null,null,null,null,null,null,null,null,null,null,null,null,"DIRECT FIXED COST"]
[null,null,null,null,null,null,null,null,null,null,""]
[null,null,null,null,null,null,null,null,null,null,null,null,null,null,null,null,null,null,null,null,null,null,null,null,null,"RISK RATED RETURNS OVER TOTAL COST"]
[null,"Temporary Winter Grazing",null,null,null,null,null,null,null,null,null,null,null,null,null,null,null,null,null,null,null,null,null,null,null,"RISK RATED RETURNS OVER CASH FLOW COST"]
[null,null,null,null,null,null,null,null,null,null,null,null,null,null,null,null,null,null,null,null,null,null,null,null,null,"RISK RATED RETURNS OVER VARIABLE COST"]
[null,null,null,null,null,null,null,null,null,null,""]
[null,null,null,null,null,"(Variable Cost Budget)",null,null,null,"Return to Main budget",""]
[null,"Number of Acres",null,null,null,{"$f":"+ACRES","v":50}]
[null,"Number of 1,000 # Animal Units/acre",null,null,null,1]
[null,"Expected number of grazing days/acre",null,null,null,150]
[]
[null,null,null,null,null,null,null,null,null,null,""]
[null,null,null,null,null,null,null,null,null,null,""]
[null,null,null,null,null,null," UNITS","TOTAL","UNIT","TOTAL","$/Acre"]
[null,"    ITEM",null,null,null,"UNIT","PER ACRE","QUANTITY","PRICE","AMOUNT"]
[null,"VARIABLE COSTS:",null,null,null,null,null,"  (units)"," ($/unit)"]
[null,"SEED"]
[null,"Rye ",null,null,null,"LBS.",60,{"$f":"G26*ACRES","v":3000},0.31,{"$f":"H26*I26","v":930},{"$f":"+J26/ACRES","v":18.600000000000001}]
[null,"Ryegrass",null,null,null,"LBS.",15,{"$f":"G27*ACRES","v":750},0.38,{"$f":"H27*I27","v":285},5.7]
[null,"Arrowleaf Clover",null,null,null,"LBS.",0,{"$f":"G28*ACRES","v":0},2,{"$f":"H28*I28","v":0},0]
[null,"Other",null,null,null,"LBS.",0,{"$f":"G29*ACRES","v":0},0.5,{"$f":"H29*I29","v":0},0]
[null,"LIME",null,null,null,"TON",0,{"$f":"G30*F16","v":0},42,{"$f":"H30*I30","v":0},0]
{"$rows_left_out":238}
{"sheet":"Rations","index":3,"n_rows":43,"n_cols":12,"rows_kept":43,"cut":false,"hidden":false,"merged":[]}
[]
[null,"Ration 1"]
[]
[null,"Ingredient","$ per Ton","% of Ration","#/Ton DM","Cost per Dry Ton",null,"Total Cost",null,null,null,{"$f":"SUM(F5:F14)","v":152.96250000000001}]
[null,"Corn",{"$f":"VLOOKUP(B5,'Ration Components'!$B$4:$D$37,3,FALSE)","v":160},0.65,{"$f":"(VLOOKUP(B5,'Ration Components'!$B$4:$D$37,2,FALSE))*2000","v":1800},{"$f":"C5*D5*E5/2000","v":93.6},null,"Number of Days on Ration",null,null,null,150]
[null,"Whole Cottonseed",{"$f":"VLOOKUP(B6,'Ration Components'!$B$4:$D$37,3,FALSE)","v":235},0.1,{"$f":"(VLOOKUP(B6,'Ration Components'!$B$4:$D$37,2,FALSE))*2000","v":1800},{"$f":"C6*D6*E6/2000","v":21.15},null,"Total Cost per Pound",null,null,null,{"$f":"L4/2000","v":7.6481250000000001E-2}]
[null,"Gin Trash",{"$f":"VLOOKUP(B7,'Ration Components'!$B$4:$D$37,3,FALSE)","v":35},0.15,{"$f":"(VLOOKUP(B7,'Ration Components'!$B$4:$D$37,2,FALSE))*2000","v":1700},4.4625000000000004,null,"Starting Weight",null,null,null,525]
[null,"Soybean Meal",{"$f":"VLOOKUP(B8,'Ration Components'!$B$4:$D$37,3,FALSE)","v":375},0.1,{"$f":"(VLOOKUP(B8,'Ration Components'!$B$4:$D$37,2,FALSE))*2000","v":1800},33.75,null,"Final Weight",null,null,null,825]
[null,"BLANK",{"$f":"VLOOKUP(B9,'Ration Components'!$B$4:$D$37,3,FALSE)","v":0},0,{"$f":"(VLOOKUP(B9,'Ration Components'!$B$4:$D$37,2,FALSE))*2000","v":1980},0,null,"Average Daily Gain",null,null,null,{"$f":"IF(L5=0,0,(L8-L7)/L5)","v":2}]
[null,"BLANK",{"$f":"VLOOKUP(B10,'Ration Components'!$B$4:$D$37,3,FALSE)","v":0},0,{"$f":"(VLOOKUP(B10,'Ration Components'!$B$4:$D$37,2,FALSE))*2000","v":1980},0,null,"Consumption as % of Bodyweight",null,null,null,1.4999999999999999E-2]
[null,"BLANK",{"$f":"VLOOKUP(B11,'Ration Components'!$B$4:$D$37,3,FALSE)","v":0},0,{"$f":"(VLOOKUP(B11,'Ration Components'!$B$4:$D$37,2,FALSE))*2000","v":1980},0,null,"Pounds Fed per Day",null,null,null,{"$f":"L10*L7","v":7.875}]
[null,"BLANK",{"$f":"VLOOKUP(B12,'Ration Components'!$B$4:$D$37,3,FALSE)","v":0},0,{"$f":"(VLOOKUP(B12,'Ration Components'!$B$4:$D$37,2,FALSE))*2000","v":1980},0,null,"Cost per Day",null,null,null,{"$f":"L11*L6","v":0.60228984375000005}]
[null,"BLANK",{"$f":"VLOOKUP(B13,'Ration Components'!$B$4:$D$37,3,FALSE)","v":0},0,{"$f":"(VLOOKUP(B13,'Ration Components'!$B$4:$D$37,2,FALSE))*2000","v":1980},0,null,"Total Cost Fed per Head",null,null,null,{"$f":"L12*L5","v":90.343476562500001}]
[null,"BLANK",{"$f":"VLOOKUP(B14,'Ration Components'!$B$4:$D$37,3,FALSE)","v":0},0,{"$f":"(VLOOKUP(B14,'Ration Components'!$B$4:$D$37,2,FALSE))*2000","v":1980},0,null,"Total Pounds Fed per Head",null,null,null,{"$f":"L11*L5","v":1181.25}]
[null,null,null,null,null,null,null,"Cost per Cwt Produced",null,null,null,{"$f":"IF(L8=0,0,L13/((L8-L7)/100))","v":30.114492187500002}]
[null,"Ration 2"]
[]
[null,"Ingredient","$ per Ton","% of Ration","#/Ton DM","Cost per Dry Ton",null,"Total Cost",null,null,null,{"$f":"SUM(F19:F28)","v":0}]
[null,"BLANK",{"$f":"VLOOKUP(B19,'Ration Components'!$B$4:$D$37,3,FALSE)","v":0},0,{"$f":"(VLOOKUP(B19,'Ration Components'!$B$4:$D$37,2,FALSE))*2000","v":1980},{"$f":"C19*D19*E19/2000","v":0},null,"Number of Days on Ration",null,null,null,0]
[null,"BLANK",{"$f":"VLOOKUP(B20,'Ration Components'!$B$4:$D$37,3,FALSE)","v":0},0,{"$f":"(VLOOKUP(B20,'Ration Components'!$B$4:$D$37,2,FALSE))*2000","v":1980},{"$f":"C20*D20*E20/2000","v":0},null,"Total Cost per Pound",null,null,null,{"$f":"L18/2000","v":0}]
[null,"BLANK",{"$f":"VLOOKUP(B21,'Ration Components'!$B$4:$D$37,3,FALSE)","v":0},0,{"$f":"(VLOOKUP(B21,'Ration Components'!$B$4:$D$37,2,FALSE))*2000","v":1980},0,null,"Starting Weight",null,null,null,0]
[null,"BLANK",{"$f":"VLOOKUP(B22,'Ration Components'!$B$4:$D$37,3,FALSE)","v":0},0,{"$f":"(VLOOKUP(B22,'Ration Components'!$B$4:$D$37,2,FALSE))*2000","v":1980},0,null,"Final Weight",null,null,null,0]
[null,"BLANK",{"$f":"VLOOKUP(B23,'Ration Components'!$B$4:$D$37,3,FALSE)","v":0},0,{"$f":"(VLOOKUP(B23,'Ration Components'!$B$4:$D$37,2,FALSE))*2000","v":1980},0,null,"Average Daily Gain",null,null,null,{"$f":"IF(L19=0,0,(L22-L21)/L19)","v":0}]
[null,"BLANK",{"$f":"VLOOKUP(B24,'Ration Components'!$B$4:$D$37,3,FALSE)","v":0},0,{"$f":"(VLOOKUP(B24,'Ration Components'!$B$4:$D$37,2,FALSE))*2000","v":1980},0,null,"Consumption as % of Bodyweight",null,null,null,1.4999999999999999E-2]
[null,"BLANK",{"$f":"VLOOKUP(B25,'Ration Components'!$B$4:$D$37,3,FALSE)","v":0},0,{"$f":"(VLOOKUP(B25,'Ration Components'!$B$4:$D$37,2,FALSE))*2000","v":1980},0,null,"Pounds Fed per Day",null,null,null,{"$f":"L24*L21","v":0}]
[null,"BLANK",{"$f":"VLOOKUP(B26,'Ration Components'!$B$4:$D$37,3,FALSE)","v":0},0,{"$f":"(VLOOKUP(B26,'Ration Components'!$B$4:$D$37,2,FALSE))*2000","v":1980},0,null,"Cost per Day",null,null,null,{"$f":"L25*L20","v":0}]
[null,"BLANK",{"$f":"VLOOKUP(B27,'Ration Components'!$B$4:$D$37,3,FALSE)","v":0},0,{"$f":"(VLOOKUP(B27,'Ration Components'!$B$4:$D$37,2,FALSE))*2000","v":1980},0,null,"Total Cost Fed per Head",null,null,null,{"$f":"L26*L19","v":0}]
[null,"BLANK",{"$f":"VLOOKUP(B28,'Ration Components'!$B$4:$D$37,3,FALSE)","v":0},0,{"$f":"(VLOOKUP(B28,'Ration Components'!$B$4:$D$37,2,FALSE))*2000","v":1980},0,null,"Total Pounds Fed per Head",null,null,null,{"$f":"L25*L19","v":0}]
[null,null,null,null,null,null,null,"Cost per Cwt Produced",null,null,null,{"$f":"IF(L22=0,0,L27/((L22-L21)/100))","v":0}]
[null,"Ration 3"]
{"$rows_left_out":14}
{"sheet":"Ration Components","index":4,"n_rows":37,"n_cols":4,"rows_kept":37,"cut":false,"hidden":false,"merged":[]}
[]
[]
[null,"Feed","Percent DM","$ per Ton"]
[null,"Hay",0.85,130]
[null,"Corn Silage",0.32,68]
[null,"Cottonseed Hulls",0.9,123]
[null,"Gin Trash",0.85,35]
[null,"Peanut Hulls",0.9,55]
[null,"Soybean Stubble",0.85,20]
[null,"Chicken Litter",0.85,35]
[null,"Corn Gluten Feed",0.9,157]
[null,"Cottonseed Meal",0.9,320]
[null,"Dried Distiller's Grains",0.9,177]
[null,"Liquid Feed",0.67,285]
[null,"Molasses Block",0.76,650]
[null,"Range Cubes",0.85,330]
[null,"Soybean Meal",0.9,375]
[null,"Sunflower Meal",0.9,350]
[null,"Urea",0.99,150]
[null,"Whole Cottonseed",0.9,235]
[null,"Whole Soybeans",0.9,125]
[null,"Barley",0.9,200]
[null,"Citrus Pulp",0.9,220]
[null,"Corn",0.9,160]
[null,"Grain Sorghum",0.9,140]
[null,"Basic Mineral",0.99,220]
[null,"Low P Mineral",0.99,200]
[null,"Limestone",0.99,125]
[null,"BLANK",0.99,0]
[null,"BLANK",0.99,0]
{"$rows_left_out":8}
{"sheet":"Procurement","index":5,"n_rows":20,"n_cols":9,"rows_kept":20,"cut":false,"hidden":false,"merged":[[16,1,16,3],[17,1,17,3],[18,1,18,3],[19,1,19,3],[1,8,1,10],[15,1,15,3],[2,1,2,7],[12,1,12,7],[12,8,12,10],[7,1,7,3],[6,1,6,3]]}
[]
[null,null,null,null,null,null,null,null,"Return to Main Budget"]
[null,"Procurement Cost Detail"]
[]
[null,"     ITEM",null,null,"UNIT","QUANTITY","PRICE","AMOUNT"]
[null,null,null,null,null,null,null," ($/hd.)"]
[null,"Order Buying",null,null,"CWT.",2,0.5,{"$f":"F7*G7","v":1}]
[null,"Hauling",null,null,"MILES",100,3.5,{"$f":"+G8*F8/34","v":10.294117647058824}]
[]
[null,"TOTAL PROCUREMENT COST",null,null,null,null,null,{"$f":"SUM(H7:H8)","v":11.294117647058824}]
[]
[]
[null,"Auction & Hauling Cost Detail",null,null,null,null,null,null,"Return to Main Budget"]
[]
[null,"     ITEM",null,null,"UNIT","QUANTITY","PRICE","AMOUNT"]
[null,"Commission",null,null,"%",{"$f":"+Main!H29*Main!H30","v":1072},0.02,{"$f":"+G16*F16","v":21.44}]
[null,"Yardage",null,null,"Day",1,0,{"$f":"+G17*F17","v":0}]
[null,"Hauling",null,null,"Miles",100,0,{"$f":"+G18*F18/24","v":0}]
[]
[null,"Total Auction & Hauling Cost",null,null,null,null,null,{"$f":"+SUM(H16:H18)","v":21.44}]

{"sheet":"Fixed_Cost","index":6,"n_rows":46,"n_cols":10,"rows_kept":46,"cut":false,"hidden":false,"merged":[[6,3,6,5],[7,3,7,5],[5,3,5,5]]}
[]
[]
[null,"INVESTMENT AND ANNUAL FIXED COST"]
[null,"(Check All Higlighted Entries this Page)"]
[]
[null,null,null,"NO. OF CALVES STOCKERED:",null,null,130]
[null,null,null,"NO. OF ACRES:",null,null,100,null,null,"Return to Budget"]
[null,null,null,"INTEREST RATE:",null,null,0.04]
[]
[null,null,null,"% OF TIME FOR",null,null,"SALVAGE","YRS. OF","CALC."]
[null,"  ITEM",null,"THIS ENTERPRISE",null,"COST","VALUE","LIFE","DEPR.","TOTAL"]
[null,"CATTLE EQUIP:",null,null,"    (%)",null,null,"    (Yr.)"," ($/yr.)"]
[null,"FENCING",null,null,1,{"$f":"1.8*1800","v":3240},0,15,{"$f":"IF(F13>0,E13*(F13-G13)/H13,0)","v":216}]
[null,"CORRAL & LOADING CHUTE",null,null,1,2200,0,10,220]
[null,"FEED BUNKS",null,null,1,2070,0,10,207]
[null,"MISC. EQUIPMENT",null,null,1,500,0,10,50]
[null,"OTHER",null,null,0,0,0,0,0]
[null,"OTHER",null,null,0,0,0,0,0]
[null,"OTHER",null,null,0,0,0,0,0]
[null,"MACHINERY & EQUIPMENT:"]
[null,"TRACTOR",null,null,0.08,25000,10000,10,{"$f":"IF(F21>0,E21*(F21-G21)/H21,0)","v":120}]
[null,"GRAIN DRILL",null,null,1,5000,1000,10,400]
[null,"DISK",null,null,0.25,6500,{"$f":"0.2*F23","v":1300},10,130]
[null,"PLOW",null,null,0.25,7000,{"$f":"0.2*F24","v":1400},10,140]
[null,"OTHER SEEDING EQUIP.",null,null,0,0,0,0,0]
[null,"OTHER",null,null,0,0,0,0,0]
[null,"LAND",null,null,0,50000,50000,30,0]
[]
[]
[null,"TOTAL CATTLE INVESTMENT",null,null,null,{"$f":"+F13*E13+F14*E14+F15*E15+F16*E16+F17*E17+F18*E18+F19*E19","v":8010},{"$f":"+G13*E13+G14*E14+G15*E15+G16*E16+E17*G17+E18*G18+E19*G19","v":0}]
{"$rows_left_out":17}
{"sheet":"Fixed_Payment","index":7,"n_rows":42,"n_cols":10,"rows_kept":42,"cut":false,"hidden":false,"merged":[[1,1,1,3],[4,1,4,3]]}
[]
[null,"Return to Budget"]
[null,"ANNUAL ENTERPRISE FIXED OUTLAYS"]
[null,"Check All Highlighted Entries this Page)"]
[]
[null,null,null,null,"NO. OF ACRES:",null,100]
[null,null,null,null,"NO. OF HEAD:",null,{"$f":"+sold","v":99}]
[]
[]
[null,"DEBT PAYMENT CALCULATION ON NEW INVESTMENT:"]
[null,"(For Use In Calculating Debt Payments on New Investment)"]
[null,null,null,"","UNIT","TOTAL","   -------FINANCING-------"]
[null,"ITEM",null,"NUMBER","COST","COST","AMOUNT","YEARS","INT.RATE","PAYMENT"]
[null,"  FACILITIES:"]
[null,"FENCE (MILES)",null,1.8,1800,{"$f":"D15*E15","v":3240},0.5,7,0.04,{"$f":"PMT(I15,H15,-F15*G15)","v":269.90757150399691}]
[null,"CORRAL &",null,null,"","","","",""]
[null,"LOADING CHUTE",null,null,"",2200,0.5,7,0.04,{"$f":"PMT(I17,H17,-F17*G17)","v":183.27057324345466}]
[null,"FEED BUNK",null,null,"",{"$f":"9*G7","v":891},0.5,7,0.04,{"$f":"PMT(I18,H18,-F18*G18)","v":74.224582163599138}]
[null,"GRINDERMIXER",null,null,null,7000,0.5,7,0.04,{"$f":"PMT(I19,H19,-F19*G19)","v":583.1336421382648}]
[null,"GRAIN BIN (2000 BU.)",null,null,null,2300,0.5,7,0.04,{"$f":"PMT(I20,H20,-F20*G20)","v":191.6010538454299}]
[null,"MISC. EQUIP.",null,null,"",400,0.5,7,0.04,{"$f":"PMT(I21,H21,-F21*G21)","v":33.32192240790085}]
[null,null,null,null,"","","","",""]
[null,"LAND",null,{"$f":"Main!F19","v":50},500,{"$f":"D23*E23","v":25000},0,30,0.03,{"$f":"PMT(I23,H23,-F23*G23)","v":0}]
[null,null,null,null,null,"","","",""]
[null,"CALCULATED TOTAL ANNUAL DEBT PAYMENT",null,null,null,null,"","","",{"$f":"SUM(J15:J23)","v":1335.4593453026464}]
[null,null,null,null,null,null,null,null,null,""]
[]
[null,"CURRENT ANNUAL DEBT PAYMENTS:"]
[null,"(For Use In Totaling Debt Payments on Existing Investment)"]
[]
{"$rows_left_out":13}
{"sheet":"J","index":8,"n_rows":0,"n_cols":0,"rows_kept":0,"cut":false,"hidden":false,"merged":[]}

{"sheet":"K","index":9,"n_rows":0,"n_cols":0,"rows_kept":0,"cut":false,"hidden":false,"merged":[]}

{"sheet":"L","index":10,"n_rows":14,"n_cols":15,"rows_kept":14,"cut":false,"hidden":false,"merged":[]}
[null,null,null,null,null,null,null,null,null,null,null,null,null,-23595.594594968865,2.2750092654188533E-2]
[null,null,null,null,null,null,null,null,null,null,null,null,null,-18314.612601769117,6.6807279375848599E-2]
[1,null,null,null,null,null,null,null,null,null,null,null,null,-13033.630608569367,0.15865531316113057]
[null,null,null,null,null,null,null,null,null,null,null,null,null,-10393.139611969493,0.22662732264844102]
[null,null,null,null,null,null,null,null,null,null,null,null,null,-7752.6486153696178,0.3085375586179277]
[null,null,null,null,null,null,null,null,null,null,null,null,null,-5112.1576187697428,0.40129373468325191]
[null,null,null,null,null,null,null,null,null,null,null,null,null,-2471.6666221698688,0.49999999977461573]
[null,null,null,null,null,null,null,null,null,null,null,null,null,-2471.6666221698688,0.49999999977461573]
[null,null,null,null,null,null,null,null,null,null,null,null,null,168.82437443000572,0.59870626531674809]
[null,null,null,null,null,null,null,null,null,null,null,null,null,2809.3153710298802,0.69146244138207225]
[null,null,null,null,null,null,null,null,null,null,null,null,null,5449.8063676297552,0.77337267735155901]
[null,null,null,null,null,null,null,null,null,null,null,null,null,8090.2973642296292,0.84134468683886943]
[null,null,null,null,null,null,null,null,null,null,null,null,null,13371.279357429379,0.93319272062415137]
[null,null,null,null,null,null,null,null,null,null,null,null,null,18652.261350629127,0.97724990734581152]